�s���{���R�[�h���͎s�撬���R�[�h,NO,�s���{����,�s�撬����,����,����_�J�i,����_�p��,POI�R�[�h,�Z��,����,�ܓx,�o�x,���p�\�j��,�J�n����,�I������,���p�\�������L����,�����i��{�j,�����i�ڍׁj,����,����_�p��,�A�N�Z�X���@,���ԏ���,�o���A�t���[���,�A���於��,�A����d�b�ԍ�,�A��������ԍ�,�摜,�摜_���C�Z���X,URL,���l
162043,1,�x�R��,���Îs,���Ö��v�є�����,�E�I�d�}�C�{�c�����n�N�u�c�J��,,,�x�R�����Îs�߉ޓ�814,,,,,9:00,17:00,12/1�`3/15�ؗj�x��,,,���v�т�凋C�O�A�x�R�p�̓�̕s�v�c�ɏo��锎���فB,,�����̕��Ƃ�ܓS�����Éw���Ԃ�5���A����I.C���Ԃ�10���B,,,,0765-22-1049,,,,,
162043,2,�x�R��,���Îs,���Ð�����,�E�I�d�X�C�]�N�J��,,,�x�R�����Îs�O�P1390,,,,,9:00,17:00,12/1�`3/15���j�x��,,,�����ōł����j�̂��鐅���فB�n���̐��������̎���ɏd�_��u�����A�����̂���W�������Ă���B�A�N�����������g���l���͓��{�ōŏ��ɍ���A�����ق̗��j�𕨌��B,,�x�R�n���S�������Éw���k��20���A����I.C���Ԃ�10���B,,,,0765-24-4100,,,,,
162043,3,�x�R��,���Îs,�C�̉w凋C�O,�E�~�m�G�L�V���L���E,,,�x�R�����Îs���ؒ�h��2500-2,,,,,9:00,17:00,������2���j���x��,,,���Â̑N������Y���A���y�Y�R�[�i�[�A���X�g�����Ȃǂ�����A���s��l�Ă��ȂǗl�X�ȃC�x���g���J�Â���Ă���B,,�����̕��Ƃ�ܓS�����Éw���Ԃ�5���A����I.C���Ԃ�7���B,,,,0765-24-4301,,,,,
162043,4,�x�R��,���Îs,���肻�h�[��,�A���\�h�[��,,,�x�R�����Îs�k�S�]2898-3,,,,,8:30,21:30,�Ηj���x��,,,������46���̓W�]������́A�������x�R�p�◧�R�A�􂪒��߂���B�A���[�i�ł́A�X�|�[�c��W����A�l�X�ȃC�x���g���J�Â����B,,�����̕��Ƃ�ܓS�����Éw���k��7���A����I.C���Ԃ�12���B,,,,0765-23-9800,,,,,
162043,5,�x�R��,���Îs,���Éw�O�ό��ē���,�E�I�d�G�L�}�G�J���R�E�A���i�C�W��,,,�x�R�����Îs�߉ޓ�1-1-2,,,,,9:00,18:00,,,,,,�����̕��Ƃ�ܓS�����Éw���k��1��,,,,0765-22-2244,,,,,
162043,6,�x�R��,���Îs,�����܂��ό��ē���,�I�I�}�`�J���R�E�A���i�C�W��,,,�x�R�����Îs�{��1-1-10,,,,,,,,,,,,�����̕��Ƃ�ܓS�����Éw���Ԃ�7��,,,,0765-55-4614,,,,,
162043,7,�x�R��,���Îs,�Ԃ̐X�E�V�_�R�K�[�f��,�n�i�m�����e���W�����}�K�[�f��,,,�x�R�����Îs���쎛1070,,,,,,,,,,9000�u�̕~�n�ɁA�t�̓n�i������{�^���A�V���N���N���A���푽�l�ȉԖ؂��炫�ւ�A�s�����͂��ߊό��q�̌e���̃X�y�[�X�ƂȂ��Ă���B,,�����̕��Ƃ�ܓS�����Éw���Ԃ�10��,,,,0765-22-1200,,,,,
162043,8,�x�R��,���Îs,���×��j����������,�E�I�d���L�V�~���]�N�n�N�u�c�J��,,,�x�R�����Îs���쎛�V�_�R1070,,,,,10:00,16:30,���j�A11/1�`3/31�x��,,,�`���Z�p������]�ˎ��ォ�珺�a�����ɂ����Ă̐����p��A�_��A����Ȃǂ̖���������W�����Ă���B,,�����̕��Ƃ�ܓS�����Éw���Ԃ�10��,,,,0765-23-1045,,,,,
162043,9,�x�R��,���Îs,凋C�O�W�]�n,�V���L���E�e���{�E�`,,,�x�R�����Îs���ؒ�h��2500-2,,,,,,,,,,��C���̉��x���ɂ���Č������܂��N�����A�����̕����Ȃǂ��L�т��蔽�]�����肷�錻�ہy凋C�O�z��������B3�����{����6����{�ɂ����A�C��18�x�ȏ�A�k�k���̔����̎����o�����₷���Ƃ���Ă���B,,�����̕��Ƃ�ܓS�����Éw���Ԃ�5���A����I.C���Ԃ�7���B,,,,,,,,,
162043,10,�x�R��,���Îs,�~���[�W�������h,�~���[�W�������h,,,�x�R�����Îs�O�P1181-1,,,,,10:00,16:00,12/1�`3�����{�x��,,,���Ð����قɗאڂ������W���[�����h�B���{�C���ő�̊ϗ��Ԃ��ڈ�B�Ăɂ͊C���v�[�����I�[�v��,,����I.C���Ԃ�15���B,,,,0765-24-6999,,,,,
162043,11,�x�R��,���Îs,�z�e���O�����~���[�W��,�z�e���O�����~���[�W��,,,�x�R�����Îs�g��1-1-20,,,,,,,,,,,,�����̕��Ƃ�ܓS�����Éw���k��5���A����I.C���Ԃ�5���B,,,,0765-24-4411,,,,,
162043,12,�x�R��,���Îs,�X�J�C�z�e������,�X�J�C�z�e���E�I�d,,,�x�R�����Îs�w�O�V��4-2,,,,,,,,,,,,�����̕��Ƃ�ܓS�����Éw���k��5���A����I.C���Ԃ�5���B,,,,0765-24-9333,,,,,
162043,13,�x�R��,���Îs,�X�J�C�z�e�����ÃA�l�b�N�X,�X�J�C�z�e���E�I�d�A�l�b�N�X,,,�x�R�����Îs�w�O�V��3-1,,,,,,,,,,,,�����̕��Ƃ�ܓS�����Éw���k��5���A����I.C���Ԃ�5���B,,,,0756-24-9339,,,,,
162043,14,�x�R��,���Îs,�r�W�l�X�z�e�����Q,�r�W�l�X�z�e���~�i�~,,,�x�R�����Îs�߉ޓ�1-16-5,,,,,,,,,,,,�����̕��Ƃ�ܓS�����Éw���k��1���A����I.C���Ԃ�5���B,,,,0765-23-0657,,,,,
162043,15,�x�R��,���Îs,�C�̌�����z�e�����Q��,�E�~�m�~�G���z�e���~�i�~�J��,,,�x�R�����Îs�߉ޓ�1-13-5,,,,,,,,,,,,�����̕��Ƃ�ܓS�����Éw���k��1���A����I.C���Ԃ�5���B,,,,0765-22-0303,,,,,
162043,16,�x�R��,���Îs,���Ã}���e���z�e���w�O,�E�I�d�}���e���z�e���G�L�}�G,,,�x�R�����Îs�߉ޓ�1-14-8,,,,,,,,,,,,�����̕��Ƃ�ܓS�����Éw���k��1���A����I.C���Ԃ�5���B,,,,0765-25-0100,,,,,
162043,17,�x�R��,���Îs,�A�p�z�e���q���Éw�O�r,�A�p�z�e���E�I�d�G�L�}�G,,,�x�R�����Îs�߉ޓ�1-1,,,,,,,,,,,,�����̕��Ƃ�ܓS�����Éw���k��30�b�A����I.C���Ԃ�10���B,,,,0765-22-8111,,,,,
162043,18,�x�R��,���Îs,�z�e���@���[�g�C������,�z�e�����[�g�C���E�I�d,,,�x�R�����Îs�㑺��2-3-39,,,,,,,,,,,,�����̕��Ƃ�ܓS�����Éw���Ԃ�2���A����I.C���Ԃ�3���B,,,,0765-22-7411,,,,,
162043,19,�x�R��,���Îs,�x�X�g�C������,�x�X�g�C���E�I�d,,,�x�R�����Îs�g��267-1,,,,,,,,,,,,�����̕��Ƃ�ܓS�����Éw���Ԃ�5���A����I.C���Ԃ�5���B����8���������B,,,,0765-24-3330,,,,,
162043,20,�x�R��,���Îs,���h��������,�I���h�C�P�K�~,,,�x�R�����Îs�k�R684,,,,,,,,,,,,�����̕��Ƃ�ܓS�����Éw���Ԃ�20���A����I.C���Ԃ�15���B,,,,0765-33-9321,,,,,
162043,21,�x�R��,���Îs,�k�R�z��q��̓����c�m�E�q���,�L�^���}�R�E�Z���R�_�J���m���K���\�j�G������,,,�x�R�����Îs�k�R702,,,,,,,,,,,,����I.C���Ԃ�15���B,,,,0765-33-9222,,,,,
162043,22,�x�R��,���Îs,�����Y����,�L���^���E�I���Z��,,,�x�R�����Îs�V�_��V6000,,,,,,,,,,,,�����̕��Ƃ�ܓS�����Éw���Ԃ�10���A����I.C���Ԃ�10���B,,,,0765-24-1220,,,,,
162043,24,�x�R��,���Îs,�҂킭�킭�����h���h����,�c�W���N���N�����h�~���V���N�`����,,,�x�R�����Îs��63-1,,,,,,,,,,,,�����̕��Ƃ�ܓS�����Éw���k����15���A����I.C���Ԃ�8���B,,,,0765-24-7447,,,,,
162043,25,�x�R��,���Îs,�~���}���V�F,�~���}���V�F,,,�x�R�����Îs�߉ޓ�1-1-1,,,,,10:00,19:00,,,,���Â̂����������Y�i�₨�y�Y��̔��B�X���ɂ͋x�e�X�y�[�X��C�[�g�C��������B,,�����̕��Ƃ�ܓS�����Éw���k����1��,,,,0765-32-3907,,,,,
162043,26,�x�R��,���Îs,������,�}���g�E�_�C,,,�x�R�����Îs�V�p��P,,,,,,,,,,�]�ˎ���̏I��肱��A���Í`�ŏ��̓���B�䒆�ɒn����F�����u���ĊC����S���F�肵�Ă���B,,�����̕��Ƃ�ܓS�����Éw���Ԃ�7��,,,,0765-23-1045,,,,,
162043,27,�x�R��,���Îs,�đ������˂̒n,�R���\�E�h�E�n�b�V���E�m�`,,,�x�R�����Îs�{��1-2-33,,,,,,,,,,�吳7�N�A�ĉ������ɋꂵ��ł������t�̎�w�琔�\�l���A�Ă̐ςݏo������߂�悤�v�������đ����̔��˂̒n�B��s�̎Љ���q�ɂ������̂����������c���Ă���B,,�����̕��Ƃ�ܓS�����Éw���Ԃ�7��,,,,0765-23-1045,,,,,
162043,28,�x�R��,���Îs,���q���,�}�c�N���W���E�Z�L,,,�x�R�����Îs���F����R3-2,,,,,,,,,,���F����R�i�W��430���j�ɒz���ꂽ�R��ŁA�z���ł��L���̋K�͂����R��ƌ����Ă���B1583�N�ɗ��邷��܂ŉz�������̒��S�Ƃ��Ĕɉh�����B,,�����̕��Ƃ�ܓS�����Éw���Ԃ�40��,,,,0765-23-1045,,,,,
162043,29,�x�R��,���Îs,�������,�}�X�K�^�W���E�Z�L,,,�x�R�����Îs�C��,,,,,,,,,,���q��̎x��̈�ŏ㐙���̏d�v�Ȓ��p���_�ł������B���Ï�̐킢�̐܁A�z��̏㐙�i������l�Ƃ��Đw��~�����Ƃ���Ƃ��ėL���B,,�����̕��Ƃ�ܓS�����Éw���Ԃ�20��,,,,0765-23-1045,,,,,
162043,30,�x�R��,���Îs,�z�K�_��,�X���W���W��,,,�x�R�����Îs�z�K��1-16,,,,,,,,,,���Â��\����Ղ�ł���A���Ă���Ղ�̉��B�u���Ẫ^�e�����s���v�̓��l�X�R���`������Y�ɓo�^����Ă���B,,�����̕��Ƃ�ܓS�����Éw���Ԃ�5���A����I.C���Ԃ�10���B,,,,,,,,,
162043,31,�x�R��,���Îs,���R�~��������,�q�K�V���}�G���g�E�u���X�C�\�E,,,�x�R�����Îs���R,,,,,,,,,,3�̗p���Ɍ����ɐ��𕪔z���邽�߂̉~���������ŁA���̔���������p���[�X�|�b�g�Ƃ��Ē��ڂ���Ă���B�~�����炠�ӂ�鐅�̗������傫���A���{��������~�������Ƃ��]�����B,,�����̕��Ƃ�ܓS�����Éw���Ԃ�15���A����I.C���Ԃ�10���B,,,,,,,,,
162043,32,�x�R��,���Îs,�ЊL�R�m��L�����v��,�J�^�J�C���}�m�����L�����v�W���E,,,�x�R�����Îs�O�P���S�c�^84-1,,,,4�����{�`11/30,,,,,,�ЊL�쉈���̃L�����v��B�I�[�g�L�����v�T�C�g�i�W���j�B�o�[�x�L���[�슮���B,,�����̕��Ƃ�ܓS�����Éw���Ԃ�30��,,,,0765-32-7755,,,,,
162043,33,�x�R��,���Îs,�����Q,�h�E�X�M�O��,,,�x�R�����Îs�O�P���m��,,,,,,,,,,�얔�J����W��500�`700���t�߂̐������500�N�ȏ�V�R�X�M�Q���n�B�Ö؂Ŋ��ɋ󓴂����邱�Ƃ��瓴���ƌĂ΂�A�ő咼�a16���̂��̂����݂���B,,,,,,,,,,,
162043,34,�x�R��,���Îs,�֐�,�w�r�C�V,,,�x�R�����Îs�얔,,,,,,,,,,�얔�J�֐΋��̏㗬���쌴�ɂ���֐΂́A�������΂ɂ��间���K�̂����̐΂Ƃ��ė��΂Ƃ���΂�A�J��̐΂Ƃ��Ēm���Ă���B,,,,,,,,,,,
162043,35,�x�R��,���Îs,�A�E�g�T�C�h���C��,�A�E�g�T�C�h���C��,,,�x�R�����Îs�o�����R36,,,,,,,,,,���R�^�������ɐݒu���ꂽ���j�������g�B��҂̓_�j�G���E���y�X�L���h�B,,�����̕��Ƃ�ܓS�����Éw���Ԃ�15���A����I.C���Ԃ�10���B,,,,,,,,,
162043,36,�x�R��,���Îs,���̒n�����[凋C�O,�J�[�m�`�w�C�Z���V���L���E,,,�x�R�����Îs���ؒ�h��2500-2,,,,,,,,,,�݂ȂƃI�A�V�X���Âɐݒu���ꂽ���j�������g�B��҂͑听�_�B,,�����̕��Ƃ�ܓS�����Éw���Ԃ�5���A����I.C���Ԃ�7���B,,,,,,,,,
162043,37,�x�R��,���Îs,���̕W��NO.51,�J�[�m�q���E�V�L�i���o�[�S�W���E�C�`,,,�x�R�����Îs�k�S�]2898-3,,,,,,,,,,���肻�h�[���ɐݒu���ꂽ���j�������g�B��҂͑听�_�B,,�����̕��Ƃ�ܓS�����Éw���k��7���A����I.C���Ԃ�12���B,,,,,,,,,
162043,38,�x�R��,���Îs,�Ձi���j�������g�j,�}�c��,,,�x�R�����Îs�O�P1390,,,,,,,,,,���Ð��������قɐݒu���ꂽ���j�������g�B��҂͑听�_�B,,�x�R�n���S�������Éw���k��20���A����I.C���Ԃ�10���B,,,,,,,,,
162043,39,�x�R��,���Îs,���Ó��R�^������,�E�I�d�������}�E���h�E�R�E�G��,,,�x�R�����Îs�䎚���R36,,,,,8:30,,�Ηj�x��,,,���Îs�̍���ɂ��鎩�R�Ɉ͂܂ꂽ���͂����ς��̑����^�������B��y������Ŏg�p����Ă������v�䂪�ڈ�B,,�����̕��Ƃ�ܓS�����Éw���Ԃ�15���A����I.C���Ԃ�10���B,,,,0765-22-0077,,,,,
162043,40,�x�R��,���Îs,�V�_�R���,�e���W�����}�W���E�Z�L,,,�x�R�����Îs���쎛�V�_�R1070,,,,,,,,,,�V��10�N�i1582�j���Ï�̐킢�ŋ��Ï�~���̂��߂ɏ㐙�i�����w��~������B�����y�ۂ��x���c���Ă���B,,�����̕��Ƃ�ܓS�����Éw���Ԃ�10��,,,,0765-23-1045,,,,,
162043,41,�x�R��,���Îs,���Â̒��s,�E�I�d�m�A�T�C�`,,,�x�R�����Îs���ؒ�h��2500-2,,,,������2�E��4���j��,6:30,9:30,,,,�N���A�������A�_�앨�Ȃǂ�̔����钩�s�B���s��H��C�x���g���[�����Ă���B������Q�E�S���j���J�ÁB,,�����̕��Ƃ�ܓS�����Éw���Ԃ�5���A����I.C���Ԃ�7���B,,,,0765-22-1200,,,,,
162043,42,�x�R��,���Îs,���Ï��,�E�I�d�W���E�Z�L,,,�x�R�����Îs�{��1-10-39,,,,,,,,,,�퍑����A�D�c�M�����V�������ڎw���A�㐙�R�Ƃ̐킢���J��L���钆�A�㐙�Ƃ̔ߌ��Ƃ��Ă΂ꂽ�V��10�N�i1582�j���Ï�̐킢�̕���ƂȂ����ꏊ�B,,�x�R�n���S���d�S���Éw����k��5��,,,,0765-23-1045,,,,,
162043,43,�x�R��,���Îs,�������E���M�̓m,�R�X�K�k�}���M�m����,,,�x�R�����Îs������1122,,,,,,,,,,�����炵���ǍD�Ȏ��R�ƃ��M�Ƃ̌��i�����邱�Ƃ��ł���B���R�Ԓn��̊������Ɣ_�n�A���A���ۑS�΍􎖋Ƃ̈�Ƃ��Ďn�܂������M�̕��q�́A�O���[���c�[���Y���󂯓���ɂ��s��n�Z���Ƃ̌𗬂�s�����w�Z�Ƃ̌𗬂ɂ����p�����B,,�����̕��Ƃ�ܓS�����Éw���Ԃ�25��,,,,,,,,,
162043,44,�x�R��,���Îs,�L��CSA�E���l�̐��n,�A���\�E�~�T�[�r�X�G���A�E�R�C�r�g�m�Z�C�`,,,�x�R�����Îs���㎚�O�c��848,,,,,,,,,,����Ɉʒu���邽�߁A�s�X�n�z���ɕx�R�p��]�ނ��Ƃ��ł���B��l�̐��n�̑I����L�O���ď��̃��j�������g�ł���~���[�W���x�����ݒu����Ă���B�������H�ʍs�҈ȊO�̗��p���\�B,,,,,,,,,,,
162043,45,�x�R��,���Îs,�V�_�R�싅��,�e���W�����}���L���E�W���E,,,�x�R�����Îs���쎛5995,,,,,,,,,,���N8���ɑS���{��w���q�싅�I�茠���J�Â���Ă���B,,�����̕��Ƃ�ܓS�����Éw���Ԃ�10��,,,,,,,,,
162043,46,�x�R��,���Îs,�V��w�т̐X�V�_�R�𗬊�,�j�C�J���}�i�r�m�����e���W�����}�R�E�����E�J��,,,�x�R�����Îs�V�_��V147-1,,,,,9:00,22:00,�ؗj�x��,,,���y�A���������A��c���C�A���U�w�K�A�_���X�A�X�|�[�c�ȂǁA���܂��܂Ȋ����̏�ƂȂ��Ă���B,,�����̕��Ƃ�ܓS�����Éw���Ԃ�10��,,,,0765-31-7001,,,,,
162043,47,�x�R��,���Îs,�V�앶���z�[��,�j�C�J���u���J�z�[��,,,�x�R�����Îs�{��110,,,,,9:00,22:00,�Ηj�x��,,,�����ł��L���̉����ݔ�������A�����Ƃ��I�ԗD�ǃz�[��100�I�ɂ��I�΂�Ă��镶���z�[���B,,�����̕��Ƃ�ܓS�����Éw���Ԃ�10��,,,,0765-23-1123,,,,,
162043,48,�x�R��,���Îs,�`�̖؊���,�J�L�m�L����,,,�x�R�����Îs�w�O�V��,,,,,,,,,,�����̕��Ƃ�ܓS�����Éw�O���H�X��200�X�ȏ�̈��H�X���W�܂��Ă���G���A�B,,�����̕��Ƃ�ܓS�����Éw���k��1��,,,,,,,,,
162043,49,�x�R��,���Îs,�����@���Ê�,�i�M�T�n�N�@�E�I�d�}��,,,�x�R�����Îs���`��V��,,,,,,,,,,,,�����̕��Ƃ�ܓS�����Éw���Ԃ�5���A����I.C���Ԃ�10���B,,,,0765-24-0068,,,,,
